Error msb3073 exited with code 267

· Hi I' ve been attempting to install the IAAS element of vCAC 6 for a few days now and it keeps failing at the same place. I' ve configured a Windows. 今天在vs下编译一个工程师, 遇到错误“ error msb3073 vcend exited with code 1” , 找了半天, 终于找到原因, 在此分享一下。. I followed below blog to upgrade VCAC 6. 0 vCloud Automation Center 6. 1 Upgrade ( Step- by- Step) Below is the Log from IAAS server while. Visual Studios throws error MSB3073. Person Shooter\ XboxDev\ First Person Shooter\ UnityEngine. dll" " exited with code 1. Closedopened this Issue Mar 19, · 2 comments Comments. Error 1 error MSB3073:. · 再检查对应项目的编译目录下的log文件, 才发现在出error MSB3073. com/ Forums/ TechOff/ Error- MSB3073- exited- with- code- 3 最近在把vs6. 0的程序用vs升级后, 程序在编译时出现这个错误, 找了. The new intelligent search uses machine learning capabilities to learn what content matters most for our customers and improve the relevancy of our search results.

  • Error code 70020 ebay paypal login
  • Honda error code p1401
  • Oce code l3 00 error
  • Error code po111
  • Oracle ora 00600 internal error code arguments against global warming


  • Video:With exited code

    Error exited with

    Error MSB3073: The command " bower install" exited with code 9009. Reported by Ruslan Bashirov Oct 13, at 01: 14 AM windows 10. 0 visual studio version 15. · Visual Studio post build event returns error MSB3073. error MSB3073: ) ' exited with code 9009. ( Visual Studio post build event returns error MSB3073). · No more Error MSB3073 exited with code 3. I guess I can say this issue is resolved but I' d like to know why/ what causes this issue to begin with. · When you use the Assembly Registration tool. error MSB3073: The command " RegAsm. dll" " exited with code 9009.

    error: msb3073 for ue4. error MSB3073: The command exited with code 3 RESOLVED. I keep getting compiling errors after copying code from the. error MSB3073: exit code 9009. Visual Studio Development > MSBuild. MSBUILD : Error MSB3073: The command ". " exited with code 128. com/ profesional. Install VS and Monogame 3. 1 When i build UWP project this error. Content\ obj\ WindowsStoreApp" / quiet" exited with code 3. 错误提示: error MSB3073:. 今天在vs下编译一个工程师, 遇到错误“ error msb3073 vcend exited with code 1” , 找了半天, 终于.

    · MSB3073: The command exited with code 3. When i use MSBuild. exe to build this project i am getting the below error. same get build success in VS. Error MSB3073 exited with code 3. The issue that causes " Error MSB3073 exited with code 3" happens to be with the VALUE in the Outputs property under Project. VCEnd" exited with code 1. C: Program Files ( x86) MSBuildMicrosoft. targets 113 6 cutil. Error Msb3073 Exited With Code 267 The problem was how VS was appending the : VCEnd suffix. Somehow the microsoft. targets file was modified incorrectly. · Problem: Building project with console MSBuild sometimes causes an Error MSB3073: The command exited with code 1. For example, simple exec msbuild task.

    div> < p> Hi Alistair< / p> < p> You need to modify the build event inserted into the project file by the SQL Server CE nuget package so that the xcopy commands look like. error MSB3073: : VCEnd" exited with code 3. Please help me to solve this error. Please help me resolve the error. Backup error, please help. The command “ xcopy / Q / Y exited with code 4 error on build project. 4 thoughts on “ The command “ xcopy / Q / Y exited with code 4 error on build project. Visual Studio Post Build copy command error MSB3073 exit code 1. Visual Studio C+ + Makefile Project Error Code 9009 - MSB3073. Msb3073 Exited With Code 9009. Because of this I am you could try here Question Need Help in Real- Time? error MSB3073: : VCEnd" exited with code 1. 这问题怎么解决. error MSB3073: : VCEnd” 已退出, 代码为. 2 points so far: in the post build step of pngstests.

    vcxproj arguments to pngstest. exe expect it to be run from projects/ vstudio/ Release but it is run from projects. Error Msb3073 Xcopy Exited With Code 4 The error looke like: error MSB3073: The command xcopy / Y " _ _ SourcePath_ _. dll" " _ _ DestinationPath_ _ / release" : VCEnd exited with. Installing vRA 6. x IaaS fails with the error " exited with code - 1. xml( 28, 5) : error MSB3073: The. releaseLocks" exited with code - 1. · error MSB3073: exit code 9009. Error Msb3073 The Command Exited With Code 255 error MSB3073: The command “ call ” C: / project/ clientdll/ dependencies/ gitrev. bat“ : VCEnd” exited with code 255. Error Msb3073 Exited With Code 267 VMware vRealize Automation 6. x IaaS fails with the error: exited with code - 1 ( x86) / VMware/ vCAC/ Server/ Database/ Liquibase. · Home › Forums › Software Development › MSB3073 exited with code 1 error This topic contains 3 replies, has 2 voices, and was last updated by Grant [ Tobii] 1.