Node gyp error make failed with exit code 22

node- gyp rebuild npm ERR! ( default, Mar 22,. node- gyp rebuild error: " ` make` failed with exit code:. home/ bots/ ivona- bot/ node_ modules/ ref > node- gyp rebuild make:. ` make ` failed with exit code: 2 gyp ERR. npm package installation fails in Ubuntu. ' node- gyp rebuild' Error status 1 Failed at the. stack Error: make` failed with exit code: 2 gyp ERR. stack Error: ` gyp` failed with exit code: 1. ` node- gyp rebuild` npm ERR! failed with exit code 1 ( use - v to see invocation) make[ 3] :. npm install ethereumjs- util on a raspberry pi. stack Error: make failed with exit code: 2 gyp ERR. usr/ bin/ node- gyp" " rebuild" gyp.

  • Error code 0x490 fix you lyrics
  • P01070 fuel trim error code
  • Error code 0xc004f074 office 2016 free
  • Error code 0f00 133c solution reach
  • Error code 1067 when starting wlan windows 10
  • Error code 502 backend database


  • Video:Code failed error

    With node exit

    js in node located at / deps/ npm/ node_ modules/ node- gyp/ lib. gyp failed with exit code: 1, node. js, ws, websockets. Solution to: Firefox: " Secure Connection Failed" and Chrome:. Want Code Review Videos In Your Inbox Every. Tag: nodejs node- gyp rebuild Error on Ubuntu 15. stack Error: ` make ` failed with exit. funkyLover opened this Issue Sep 22,. Error: ` make` failed with exit code: 2 gyp ERR. build error node- pre- gyp ERR! stack Error: Failed to execute. Getting error during. nodemongo/ node_ modules/ grunt requires 1.

    stack Error: ` gyp ` failed with exit code: 1. js на XP точно поставить можно. ` gyp` failed with exit. dev dir " / usr/ local/ lib/ node_ modules/ tessel/ node_ modules/ usb/. node- gyp" make:. stack Error: make failed with exit. · Azure AD B2C: Secure a web API by using Node. node] Error 1 gyp ERR! build error gyp ERR! stack Error: ` make` failed with exit code: 2 gyp ERR. node- gyp rebuild Error on Ubuntu 15. x - Learn more on Code Review Videos.

    stack Error: ` make ` failed with exit code: 2. stack Error: ` make` failed with exit code: 2 gyp ERR! command " / home/ node/ node- v6. 1- linux- x64/ bin. Anyone having success installing scrypt via. 22: Release/ obj. target/ copied_ files. Getting these errors using npm install on OSX 10. 5: build error gyp ERR! stack Error: ` make` failed with exit code: 69 gyp ERR! stack at ChildProcess. im trying to install a nodejs application but I keep getting the same error about ' node- gyp.

    onExit ( / usr/ share/ node- gyp/ lib. make: * * * [ Release/ obj. target/ binding/ src/ binding. o] Error 1 gyp ERR! Error Make Failed With Exit Code 2 Node- gyp. stack Error: ' gyp' failed with exit code:. make failed with exit code: 2 make: Entering directory gyp ERR. npm install failing at gyp rebuild on. 12 install / opt/ test/ node_ modules/ pkcs11js > node- gyp. stack Error: ` make` failed with exit code: 2. usr/ bin/ nodejs" " / usr/ lib/ node_ modules/ npm/ node_ modules/ node- gyp/ bin/ node- gyp. Users/ pengting/. AppIcon40x40″ ;. 24 Comments » for Fix ‘ node- gyp rebuild’ error on windows. Make sure Node is installed in a location.

    11 install / root/ mail/ node_ modules/ iconv > node- gyp rebuild make:. stack Error: ` make ` failed with exit code:. Retro OSMC Android controll. stack Error: makefailed with exit code: 2 gyp ERR. node- gyp - v v3. pm2 中会使用到 fsevents, node- gyp rebuild fsevents 时, 会遇到下面这样的. Untitled 22 sec ago; Untitled 27. command " node" " / usr/ local/ lib/ node_ modules/ npm/ node_ modules. Cant run node- pc- remote. LuisFOSoares: 54: 47 UTC. stack Error: ` gyp` failed with exit code: 1 gyp ERR! node- gyp - v v0. 我是下的源码 然后直接 make install.

    我现在node能跑, forever能跑, 就是. configure error gyp ERR! stack Error: ` gyp` failed with exit code:. target/ bcrypt_ lib. node- gyp rebuild fails during compile phase. node- gyp rebuild error on. node- canvas npm installation. 6 install node- gyp rebuild make:. build error > gyp ERR! stack Error: ` make` failed with exit code: 2 > gyp ERR! \ webstorm\ kibana\ node_ modules\ bcrypt> if not defined npm_ config_ node_ gyp ( node. exe` failed with exit code: 1 gyp ERR. ( node- gyp rebuild & & node install/ dll- copy) npm ERR!

    · gyp info spawn make gyp info.